Professional Web Applications Themes

Cannot compile new kernel :( - Linux Setup, Configuration & Administration

Hi ! I cannot compile the new kernel here (Redhat 9): make menuconfig results in : HOSTCC scripts/fixdep SHIPPED scripts/kconfig/zconf.tab.h HOSTCC scripts/kconfig/conf.o HOSTCC scripts/kconfig/mconf.o SHIPPED scripts/kconfig/zconf.tab.c SHIPPED scripts/kconfig/lex.zconf.c HOSTCC -fPIC scripts/kconfig/zconf.tab.o HOSTLLD -shared scripts/kconfig/libkconfig.so HOSTLD scripts/kconfig/mconf HOSTCC scripts/lxdialog/checklist.o Dans le fichier inclus à partir de scripts/lxdialog/checklist.c:24: scripts/lxdialog/dialog.h:29:20: curses.h: Aucun fichier ou répertoire de ce type Dans le fichier inclus à partir de scripts/lxdialog/checklist.c:24: scripts/lxdialog/dialog.h:127: erreur d'yse syntaxique avant « use_colors » scripts/lxdialog/dialog.h:127: AVERTISSEMENT: type utilisé par défaut « int» dans la déclaration de « use_colors » scripts/lxdialog/dialog.h:127: AVERTISSEMENT: définition de données n'a pas de type ou de classe de stockage ...

  1. #1

    Default Cannot compile new kernel :(

    Hi !
    I cannot compile the new kernel here (Redhat 9):

    make menuconfig results in :

    HOSTCC scripts/fixdep
    SHIPPED scripts/kconfig/zconf.tab.h
    HOSTCC scripts/kconfig/conf.o
    HOSTCC scripts/kconfig/mconf.o
    SHIPPED scripts/kconfig/zconf.tab.c
    SHIPPED scripts/kconfig/lex.zconf.c
    HOSTCC -fPIC scripts/kconfig/zconf.tab.o
    HOSTLLD -shared scripts/kconfig/libkconfig.so
    HOSTLD scripts/kconfig/mconf
    HOSTCC scripts/lxdialog/checklist.o
    Dans le fichier inclus à partir de scripts/lxdialog/checklist.c:24:
    scripts/lxdialog/dialog.h:29:20: curses.h: Aucun fichier ou répertoire
    de ce type
    Dans le fichier inclus à partir de scripts/lxdialog/checklist.c:24:
    scripts/lxdialog/dialog.h:127: erreur d'yse syntaxique avant «
    use_colors »
    scripts/lxdialog/dialog.h:127: AVERTISSEMENT: type utilisé par défaut «
    int» dans la déclaration de « use_colors »
    scripts/lxdialog/dialog.h:127: AVERTISSEMENT: définition de données n'a
    pas de type ou de classe de stockage
    scripts/lxdialog/dialog.h:128: erreur d'yse syntaxique avant «
    use_shadow »
    scripts/lxdialog/dialog.h:128: AVERTISSEMENT: type utilisé par défaut «
    int» dans la déclaration de « use_shadow »
    scripts/lxdialog/dialog.h:128: AVERTISSEMENT: définition de données n'a
    pas de type ou de classe de stockage
    scripts/lxdialog/dialog.h:130: erreur d'yse syntaxique avant «
    attributes »
    scripts/lxdialog/dialog.h:130: AVERTISSEMENT: type utilisé par défaut «
    int» dans la déclaration de « attributes »
    scripts/lxdialog/dialog.h:130: AVERTISSEMENT: définition de données n'a
    pas de type ou de classe de stockage
    scripts/lxdialog/dialog.h:143: erreur d'yse syntaxique avant le
    jeton « * »
    scripts/lxdialog/dialog.h:143: AVERTISSEMENT: déclaration de fonction
    n'est pas un prototype
    scripts/lxdialog/dialog.h:146: erreur d'yse syntaxique avant le
    jeton « * »
    scripts/lxdialog/dialog.h:146: AVERTISSEMENT: déclaration de fonction
    n'est pas un prototype
    scripts/lxdialog/dialog.h:147: erreur d'yse syntaxique avant le
    jeton « * »
    scripts/lxdialog/dialog.h:147: AVERTISSEMENT: déclaration de fonction
    n'est pas un prototype
    scripts/lxdialog/dialog.h:148: erreur d'yse syntaxique avant le
    jeton « * »
    scripts/lxdialog/dialog.h:149: AVERTISSEMENT: déclaration de fonction
    n'est pas un prototype
    scripts/lxdialog/dialog.h:150: erreur d'yse syntaxique avant le
    jeton « * »
    scripts/lxdialog/dialog.h:150: AVERTISSEMENT: déclaration de fonction
    n'est pas un prototype
    scripts/lxdialog/checklist.c:32: erreur d'yse syntaxique avant le
    jeton « * »
    scripts/lxdialog/checklist.c:34: AVERTISSEMENT: déclaration de fonction
    n'est pas un prototype
    scripts/lxdialog/checklist.c: Dans la fonction « print_item »:
    scripts/lxdialog/checklist.c:38: AVERTISSEMENT: déclaration implicite de
    la fonction « wattrset »
    scripts/lxdialog/checklist.c:38: « win » non déclaré (première
    utilisation dans cette fonction)
    scripts/lxdialog/checklist.c:38: (Chaque identificateur non déclaré est
    rapporté une seule fois
    scripts/lxdialog/checklist.c:38: pour chaque fonction dans laquelle il
    apparaît.)
    scripts/lxdialog/checklist.c:39: AVERTISSEMENT: déclaration implicite de
    la fonction « wmove »
    scripts/lxdialog/checklist.c:39: « choice » non déclaré (première
    utilisation dans cette fonction)
    scripts/lxdialog/checklist.c:41: AVERTISSEMENT: déclaration implicite de
    la fonction « waddch »
    scripts/lxdialog/checklist.c:44: « selected » non déclaré (première
    utilisation dans cette fonction)
    scripts/lxdialog/checklist.c:46: AVERTISSEMENT: déclaration implicite de
    la fonction « wprintw »
    scripts/lxdialog/checklist.c:46: « status » non déclaré (première
    utilisation dans cette fonction)
    scripts/lxdialog/checklist.c:51: AVERTISSEMENT: déclaration implicite de
    la fonction « mvwaddch »
    scripts/lxdialog/checklist.c:51: « item » non déclaré (première
    utilisation dans cette fonction)
    scripts/lxdialog/checklist.c:53: AVERTISSEMENT: déclaration implicite de
    la fonction « waddstr »
    scripts/lxdialog/checklist.c:56: AVERTISSEMENT: déclaration implicite de
    la fonction « wrefresh »
    scripts/lxdialog/checklist.c: Au niveau supérieur:
    scripts/lxdialog/checklist.c:64: erreur d'yse syntaxique avant le
    jeton « * »
    scripts/lxdialog/checklist.c:66: AVERTISSEMENT: déclaration de fonction
    n'est pas un prototype
    scripts/lxdialog/checklist.c: Dans la fonction « print_arrows »:
    scripts/lxdialog/checklist.c:67: « win » non déclaré (première
    utilisation dans cette fonction)
    scripts/lxdialog/checklist.c:67: « y » non déclaré (première utilisation
    dans cette fonction)
    scripts/lxdialog/checklist.c:67: « x » non déclaré (première utilisation
    dans cette fonction)
    scripts/lxdialog/checklist.c:69: « scroll » non déclaré (première
    utilisation dans cette fonction)
    scripts/lxdialog/checklist.c:82: « height » non déclaré (première
    utilisation dans cette fonction)
    scripts/lxdialog/checklist.c:85: « item_no » non déclaré (première
    utilisation dans cette fonction)
    scripts/lxdialog/checklist.c:85: « choice » non déclaré (première
    utilisation dans cette fonction)
    scripts/lxdialog/checklist.c: Au niveau supérieur:
    scripts/lxdialog/checklist.c:103: erreur d'yse syntaxique avant le
    jeton « * »
    scripts/lxdialog/checklist.c:104: AVERTISSEMENT: déclaration de fonction
    n'est pas un prototype
    scripts/lxdialog/checklist.c: Dans la fonction « print_buttons »:
    scripts/lxdialog/checklist.c:105: « width » non déclaré (première
    utilisation dans cette fonction)
    scripts/lxdialog/checklist.c:106: « height » non déclaré (première
    utilisation dans cette fonction)
    scripts/lxdialog/checklist.c:108: « dialog » non déclaré (première
    utilisation dans cette fonction)
    scripts/lxdialog/checklist.c:108: « selected » non déclaré (première
    utilisation dans cette fonction)
    scripts/lxdialog/checklist.c: Dans la fonction « dialog_checklist »:
    scripts/lxdialog/checklist.c:126: « WINDOW » non déclaré (première
    utilisation dans cette fonction)
    scripts/lxdialog/checklist.c:126: « dialog » non déclaré (première
    utilisation dans cette fonction)
    scripts/lxdialog/checklist.c:126: « list » non déclaré (première
    utilisation dans cette fonction)
    scripts/lxdialog/checklist.c:126: AVERTISSEMENT: l'opérande à gauche de
    la virgule dans l'expression n'a pas d'effet
    scripts/lxdialog/checklist.c:132: AVERTISSEMENT: déclaration implicite
    de la fonction « endwin »
    scripts/lxdialog/checklist.c:133: AVERTISSEMENT: déclaration implicite
    de la fonction « fprintf »
    scripts/lxdialog/checklist.c:133: « stderr » non déclaré (première
    utilisation dans cette fonction)
    scripts/lxdialog/checklist.c:148: « COLS » non déclaré (première
    utilisation dans cette fonction)
    scripts/lxdialog/checklist.c:149: « LINES » non déclaré (première
    utilisation dans cette fonction)
    scripts/lxdialog/checklist.c:151: « stdscr » non déclaré (première
    utilisation dans cette fonction)
    scripts/lxdialog/checklist.c:153: AVERTISSEMENT: déclaration implicite
    de la fonction « newwin »
    scripts/lxdialog/checklist.c:154: AVERTISSEMENT: déclaration implicite
    de la fonction « keypad »
    scripts/lxdialog/checklist.c:154: « TRUE » non déclaré (première
    utilisation dans cette fonction)
    scripts/lxdialog/checklist.c:187: AVERTISSEMENT: déclaration implicite
    de la fonction « subwin »
    scripts/lxdialog/checklist.c:219: AVERTISSEMENT: déclaration implicite
    de la fonction « wnoutrefresh »
    scripts/lxdialog/checklist.c:221: AVERTISSEMENT: déclaration implicite
    de la fonction « doupdate »
    scripts/lxdialog/checklist.c:224: AVERTISSEMENT: déclaration implicite
    de la fonction « wgetch »
    scripts/lxdialog/checklist.c:231: « KEY_UP » non déclaré (première
    utilisation dans cette fonction)
    scripts/lxdialog/checklist.c:231: « KEY_DOWN » non déclaré (première
    utilisation dans cette fonction)
    scripts/lxdialog/checklist.c:241: « FALSE » non déclaré (première
    utilisation dans cette fonction)
    scripts/lxdialog/checklist.c:242: AVERTISSEMENT: déclaration implicite
    de la fonction « scrollok »
    scripts/lxdialog/checklist.c:243: AVERTISSEMENT: déclaration implicite
    de la fonction « wscrl »
    scripts/lxdialog/checklist.c:270: objet appelé n'est pas une fonction
    scripts/lxdialog/checklist.c:305: AVERTISSEMENT: déclaration implicite
    de la fonction « delwin »
    scripts/lxdialog/checklist.c:309: « KEY_LEFT » non déclaré (première
    utilisation dans cette fonction)
    scripts/lxdialog/checklist.c:310: « KEY_RIGHT » non déclaré (première
    utilisation dans cette fonction)
    /usr/include/bits/string2.h: Au niveau supérieur:
    scripts/lxdialog/dialog.h:130: AVERTISSEMENT: on assume que le tableau «
    attributes » a un élément
    make[2]: *** [scripts/lxdialog/checklist.o] Erreur 1
    make[1]: *** [menuconfig] Erreur 2
    make: *** [menuconfig] Erreur 2

    Is there any depedencies I am missing ?

    I downloaded the kernel from kernel.org
    and got gcc 3.2.2


    any ideas ?
    charly Guest

  2. #2

    Default Re: Cannot compile new kernel :(

    Kernel version is 2.6.1
    If I try make xconfig, then it asks for the QT package which is
    installed since "rpm -q "qt" gives results...

    I do not understand the problem here :(


    charly Guest

  3. #3

    Default Re: Cannot compile new kernel :(

    On Wed, 14 Jan 2004 10:17:31 +0100, charly typed:
     

    Make sure you have these packages (or newer) installed;
    qt-devel-3.1.2-0.9x.2
    qt-3.1.2-0.9x.2
    kdebase-devel-3.1-15

    And read; http://thomer.com/linux/migrate-to-2.6.html


    --
    SCO + RICO Act = Justice

    Hi! I'm a .sig virus! Copy me to your .sig!

    Lenard Guest

Similar Threads

  1. Compile kernel for Fedora
    By Baho in forum Linux Setup, Configuration & Administration
    Replies: 12
    Last Post: January 13th, 11:01 PM
  2. Kernel compile
    By Arron in forum Linux Setup, Configuration & Administration
    Replies: 1
    Last Post: July 26th, 07:01 PM
  3. kernel compile the debian way
    By Rudy Gevaert in forum Debian
    Replies: 2
    Last Post: July 6th, 10:00 AM
  4. Compile kernel
    By Baho Utot in forum Linux Setup, Configuration & Administration
    Replies: 6
    Last Post: July 1st, 08:04 AM

Bookmarks

Posting Permissions

  • You may not post new threads
  • You may not post replies
  • You may not post attachments
  • You may not edit your posts
  •  

1 2 3 4 5 6 7 8 9 10 11 12 13 14 15 16 17 18 19 20 21 22 23 24 25 26 27 28 29 30 31 32 33 34 35 36 37 38 39 40 41 42 43 44 45 46 47 48 49 50 51 52 53 54 55 56 57 58 59 60 61 62 63 64 65 66 67 68 69 70 71 72 73 74 75 76 77 78 79 80 81 82 83 84 85 86 87 88 89 90 91 92 93 94 95 96 97 98 99 100 101 102 103 104 105 106 107 108 109 110 111 112 113 114 115 116 117 118 119 120 121 122 123 124 125 126 127 128 129 130 131 132 133 134 135 136 137 138 139