hi,

testing my make of XML::Schema under perl 5.00503 on Sun solaris
resulted in lots of errors. Can someone help me with this problem?

Antoine Janssen

# make test
PERL_DL_NONLAZY=1 /usr/bin/perl -Iblib/arch -Iblib/lib
-I/usr/perl5/5.00503/sun4-solaris -I/usr/perl5/5.00503 -e 'use
Test::Harness qw(&runtests $verbose); $verbose=0; runtests ARGV;'
t/*.t
t/attrgroup.........Use of uninitialized value at
lib/XML/Schema/Base.pm line 61.
Can't locate object method "new" via package
"XML::Schema::Facet::whiteSpace" at lib/XML/Schema/Type/Simple.pm line
202.
dubious
Test returned status 255 (wstat 65280, 0xff00)
DIED. FAILED tests 78-174
Failed 97/174 tests, 44.25% okay
t/attribute.........Use of uninitialized value at
lib/XML/Schema/Base.pm line 61.
Can't locate object method "new" via package
"XML::Schema::Facet::whiteSpace" at lib/XML/Schema/Type/Simple.pm line
202.
dubious
Test returned status 255 (wstat 65280, 0xff00)
after all the subtests completed successfully
t/base..............Use of uninitialized value at
lib/XML/Schema/Base.pm line 61.
ok
t/builtin...........Use of uninitialized value at
lib/XML/Schema/Base.pm line 61.
Can't locate object method "new" via package
"XML::Schema::Facet::whiteSpace" at lib/XML/Schema/Type/Simple.pm line
202.
dubious
Test returned status 255 (wstat 65280, 0xff00)
after all the subtests completed successfully
t/choice............Use of uninitialized value at
lib/XML/Schema/Base.pm line 61.
Can't locate object method "new" via package
"XML::Schema::Facet::whiteSpace" at lib/XML/Schema/Type/Simple.pm line
202.
dubious
Test returned status 255 (wstat 65280, 0xff00)
after all the subtests completed successfully
t/complex...........Use of uninitialized value at
lib/XML/Schema/Base.pm line 61.
Can't locate object method "new" via package
"XML::Schema::Facet::maxLength" at lib/XML/Schema/Type/Simple.pm line
202.
dubious
Test returned status 255 (wstat 65280, 0xff00)
after all the subtests completed successfully
t/constants.........ok
t/content...........ok
t/element...........Use of uninitialized value at
lib/XML/Schema/Base.pm line 61.
ok
t/enum..............Use of uninitialized value at
lib/XML/Schema/Base.pm line 61.
Can't locate object method "new" via package
"XML::Schema::Facet::enumeration" at lib/XML/Schema/Type/Simple.pm
line 202.
dubious
Test returned status 255 (wstat 65280, 0xff00)
t/exception.........ok
t/facet.............Use of uninitialized value at
lib/XML/Schema/Base.pm line 61.
ok
t/handler...........Use of uninitialized value at
lib/XML/Schema/Base.pm line 61.
Can't locate object method "new" via package
"XML::Schema::Facet::maxLength" at lib/XML/Schema/Type/Simple.pm line
202.
dubious
Test returned status 255 (wstat 65280, 0xff00)
DIED. FAILED tests 1-52
Failed 52/52 tests, 0.00% okay
t/id................Use of uninitialized value at
lib/XML/Schema/Base.pm line 61.
bro don't do no hash thang at t/id.t line 78
dubious
Test returned status 255 (wstat 65280, 0xff00)
DIED. FAILED tests 5-6
Failed 2/6 tests, 66.67% okay
t/instance..........Use of uninitialized value at
lib/XML/Schema/Base.pm line 61.
ok
t/list..............Use of uninitialized value at
lib/XML/Schema/Base.pm line 61.
Can't locate object method "new" via package
"XML::Schema::Facet::whiteSpace" at lib/XML/Schema/Type/Simple.pm line
202.
dubious
Test returned status 255 (wstat 65280, 0xff00)
t/name..............Use of uninitialized value at
lib/XML/Schema/Base.pm line 61.
ok
t/names.............Use of uninitialized value at
lib/XML/Schema/Base.pm line 61.
ok
t/pr............Use of uninitialized value at
lib/XML/Schema/Base.pm line 61.
ok
t/particle..........Use of uninitialized value at
lib/XML/Schema/Base.pm line 61.
ok
t/person............Use of uninitialized value at
lib/XML/Schema/Base.pm line 61.
ok
t/scheduler.........Use of uninitialized value at
lib/XML/Schema/Scheduler.pm line 113.
Can't locate object method "new" via package
"XML::Schema::Facet::whiteSpace" at lib/XML/Schema/Type/Simple.pm line
202.
dubious
Test returned status 255 (wstat 65280, 0xff00)
DIED. FAILED tests 12-13
Failed 2/13 tests, 84.62% okay
t/scope.............Use of uninitialized value at
lib/XML/Schema/Base.pm line 61.
Can't locate object method "new" via package
"XML::Schema::Facet::pattern" at lib/XML/Schema/Type/Simple.pm line
202.
dubious
Test returned status 255 (wstat 65280, 0xff00)
after all the subtests completed successfully
t/sequence..........Use of uninitialized value at
lib/XML/Schema/Base.pm line 61.
Can't locate object method "new" via package
"XML::Schema::Facet::whiteSpace" at lib/XML/Schema/Type/Simple.pm line
202.
dubious
Test returned status 255 (wstat 65280, 0xff00)
after all the subtests completed successfully
t/simple............Use of uninitialized value at
lib/XML/Schema/Base.pm line 61.
Can't locate object method "new" via package
"XML::Schema::Facet::maxLength" at lib/XML/Schema/Type/Simple.pm line
202.
dubious
Test returned status 255 (wstat 65280, 0xff00)
DIED. FAILED tests 17-48
Failed 32/48 tests, 33.33% okay
t/type..............Use of uninitialized value at
lib/XML/Schema/Base.pm line 61.
ok
t/union.............Use of uninitialized value at
lib/XML/Schema/Base.pm line 61.
Can't locate object method "new" via package
"XML::Schema::Facet::whiteSpace" at lib/XML/Schema/Type/Simple.pm line
202.
dubious
Test returned status 255 (wstat 65280, 0xff00)
DIED. FAILED tests 1-13
Failed 13/13 tests, 0.00% okay
t/wildcard..........Use of uninitialized value at
lib/XML/Schema/Base.pm line 61.
ok
Failed Test Status Wstat Total Fail Failed List of failed
-------------------------------------------------------------------------------
t/attrgroup.t 255 65280 174 97 55.75% 78-174
t/attribute.t 255 65280 73 0 0.00% ??
t/builtin.t 255 65280 2 0 0.00% ??
t/choice.t 255 65280 8 0 0.00% ??
t/complex.t 255 65280 31 0 0.00% ??
t/enum.t 255 65280 ?? ?? % ??
t/handler.t 255 65280 52 52 100.00% 1-52
t/id.t 255 65280 6 2 33.33% 5-6
t/list.t 255 65280 ?? ?? % ??
t/scheduler.t 255 65280 13 2 15.38% 12-13
t/scope.t 255 65280 2 0 0.00% ??
t/sequence.t 255 65280 8 0 0.00% ??
t/simple.t 255 65280 48 32 66.67% 17-48
t/union.t 255 65280 13 13 100.00% 1-13
Failed 14/28 test scripts, 50.00% okay. 198/916 subtests failed,
78.38% okay.
*** Error code 29
make: Fatal error: Command failed for target `test_dynamic'