Professional Web Applications Themes

perl SAP RFC SDK make problems in fedora - PERL Modules

Hi I'm trying to install Perl module SAP-Rfc-1.32 on my Fedora FC4 installation (x86_32). Whe I do make, or make test, I keep getting: gcc -c -I/usr/sap/rfcsdk/include -D_REENTRANT -D_GNU_SOURCE -DDEBUGGING -fno-strict-aliasing -pipe -I/usr/local/include -D_LARGEFILE_SOURCE -D_FILE_OFFSET_BITS=64 -I/usr/include/gdbm -O2 -g -pipe -Wp ,-D_FORTIFY_SOURCE=2 -fexceptions -m32 -march=i386 -mtune=pentium4 -fasynchronous-unwind-tables -D VERSION=\"1.32\" -DXS_VERSION=\"1.32\" -fPIC "-I/usr/lib/perl5/5.8.6/i386-linux-thread-multi/CORE" -DSUMITELSE Rfc.c Rfc.xs: In function ‚make_copy‚: Rfc.xs:183: warning: pointer targets in passing argument 3 of ‚Perl_sv_2pv_flags‚ differ in signedne ss Rfc.xs:183: warning: pointer targets in passing argument 3 of ‚Perl_sv_2pv_flags‚ differ in signedne ss Rfc.xs: In function ‚make_strdup‚: Rfc.xs:200: warning: pointer targets in passing argument 3 of ‚Perl_sv_2pv_flags‚ differ ...

  1. #1

    Default perl SAP RFC SDK make problems in fedora

    Hi
    I'm trying to install Perl module SAP-Rfc-1.32 on my Fedora FC4
    installation (x86_32).
    Whe I do make, or make test, I keep getting:
    gcc -c -I/usr/sap/rfcsdk/include -D_REENTRANT -D_GNU_SOURCE
    -DDEBUGGING -fno-strict-aliasing -pipe
    -I/usr/local/include -D_LARGEFILE_SOURCE -D_FILE_OFFSET_BITS=64
    -I/usr/include/gdbm -O2 -g -pipe -Wp
    ,-D_FORTIFY_SOURCE=2 -fexceptions -m32 -march=i386 -mtune=pentium4
    -fasynchronous-unwind-tables -D VERSION=\"1.32\"
    -DXS_VERSION=\"1.32\" -fPIC
    "-I/usr/lib/perl5/5.8.6/i386-linux-thread-multi/CORE"
    -DSUMITELSE Rfc.c
    Rfc.xs: In function ‚make_copy‚:
    Rfc.xs:183: warning: pointer targets in passing argument 3 of
    ‚Perl_sv_2pv_flags‚ differ in signedne ss
    Rfc.xs:183: warning: pointer targets in passing argument 3 of
    ‚Perl_sv_2pv_flags‚ differ in signedne ss
    Rfc.xs: In function ‚make_strdup‚:
    Rfc.xs:200: warning: pointer targets in passing argument 3 of
    ‚Perl_sv_2pv_flags‚ differ in signedne ss
    Rfc.xs:200: warning: pointer targets in passing argument 3 of
    ‚Perl_sv_2pv_flags‚ differ in signedne ss
    Rfc.xs: In function ‚MyRfcCallReceive‚:
    Rfc.xs:445: error: invalid lvalue in assignment
    Rfc.xs: In function ‚handle_request‚:
    Rfc.xs:1205: error: invalid lvalue in assignment
    make: *** [Rfc.o] Error 1

    Can anyone tell me how to fix?

    thanks,
    TD

    thulsa.doom@gmail.com Guest

  2. #2

    Default Re: perl SAP RFC SDK make problems in fedora

    dumbass me.
    I should have used SAPRFC 1.39!
    Above error has disappeared.

    Now when I type make test, I get:
    PERL_DL_NONLAZY=1 /usr/bin/perl "-MExtUtils::Command::MM" "-e"
    "test_harness(0, 'blib/lib', 'blib/arch')" t/*.t
    t/00use....Can't load
    '/usr/ftproot/Install/unix/perl/modules/SAP-Rfc-1.39/blib/arch/auto/SAP/Rfc/Rfc.so'
    for module SAP::Rfc: librfccm.so: cannot open shared object file: No
    such file or directory at
    /usr/lib/perl5/5.8.6/i386-linux-thread-multi/DynaLoader.pm line 230.
    at t/00use.t line 4
    Compilation failed in require at t/00use.t line 4.
    BEGIN failed--compilation aborted at t/00use.t line 4.
    t/00use....dubious
    Test returned status 255 (wstat 65280, 0xff00)
    DIED. FAILED test 1
    Failed 1/1 tests, 0.00% okay
    t/01sap....Can't load
    '/usr/ftproot/Install/unix/perl/modules/SAP-Rfc-1.39/blib/arch/auto/SAP/Rfc/Rfc.so'
    for module SAP::Rfc: librfccm.so: cannot open shared object file: No
    such file or directory at
    /usr/lib/perl5/5.8.6/i386-linux-thread-multi/DynaLoader.pm line 230.
    at t/01sap.t line 4
    Compilation failed in require at t/01sap.t line 4.
    BEGIN failed--compilation aborted at t/01sap.t line 4.
    t/01sap....dubious
    Test returned status 255 (wstat 65280, 0xff00)
    DIED. FAILED tests 1-6
    Failed 6/6 tests, 0.00% okay
    Failed Test Stat Wstat Total Fail Failed List of Failed
    -------------------------------------------------------------------------------
    t/00use.t 255 65280 1 1 100.00% 1
    t/01sap.t 255 65280 6 11 183.33% 1-6
    Failed 2/2 test scripts, 0.00% okay. 7/7 subtests failed, 0.00% okay.
    make: *** [test_dynamic] Error 255

    Thulsa Doom Guest

Similar Threads

  1. Fedora Core 2 MX 7.1 Install Problems
    By solpath in forum Coldfusion - Getting Started
    Replies: 3
    Last Post: October 7th, 05:50 PM
  2. Problems with CGI::Session in Perl
    By David Staschover in forum PERL Modules
    Replies: 1
    Last Post: August 9th, 12:15 AM
  3. problems using Net::SSH::Perl in a while loop
    By Thonas Siegenthaler in forum PERL Modules
    Replies: 4
    Last Post: April 29th, 07:24 PM
  4. GNU make & make.pl are dead: long live Perl makepp
    By Daniel Pfeiffer in forum PERL Miscellaneous
    Replies: 1
    Last Post: September 9th, 07:31 AM
  5. PERL - problems with use
    By Alan Vowles in forum PERL Miscellaneous
    Replies: 1
    Last Post: June 26th, 06:22 PM

Bookmarks

Posting Permissions

  • You may not post new threads
  • You may not post replies
  • You may not post attachments
  • You may not edit your posts
  •  

1 2 3 4 5 6 7 8 9 10 11 12 13 14 15 16 17 18 19 20 21 22 23 24 25 26 27 28 29 30 31 32 33 34 35 36 37 38 39 40 41 42 43 44 45 46 47 48 49 50 51 52 53 54 55 56 57 58 59 60 61 62 63 64 65 66 67 68 69 70 71 72 73 74 75 76 77 78 79 80 81 82 83 84 85 86 87 88 89 90 91 92 93 94 95 96 97 98 99 100 101 102 103 104 105 106 107 108 109 110 111 112 113 114 115 116 117 118 119 120 121 122 123 124 125 126 127 128 129 130 131 132 133 134 135 136 137 138 139